{"text_format":"1","workbook":"xlsx","n_sheets":3,"sheets":["code2","入力","集計"],"not_rendered":{"charts":0,"images":2,"macros":1,"external_links":0,"defined_names":8,"comments":0,"pivot_tables":0},"unopened":[],"bounds":{"document_bytes":16777216,"sheet_cells":100000,"rows_first":2000,"rows_last":500,"rows_between":2000,"halvings":0,"cell_chars":16384,"cell_head_chars":4096},"cells_cut":0,"cells_raw":0,"read":"whole","date_system":"1900"}

{"sheet":"code2","index":0,"n_rows":36,"n_cols":7,"rows_kept":36,"cut":false,"hidden":false,"merged":[]}
[]
[]
["code","科目","細目"]
[100,"寄付金"]
[110,"助成金"]
[120,"受取利息"]
[130,"雑収入"]
[200,"事務費","文具代"]
[210,"地代・家賃","家賃","駐車場代"]
[220,"車両費","ガソリン代","保険","車検費用","修理費","駐車場代"]
[230,"人件費"]
[240,"法定福利費"]
[250,"水道光熱費"]
[260,"通信費"]
[270,"器具備品費"]
[280,"消耗品費"]
[290,"印刷費"]
[300,"会議費"]
[310,"修繕費"]
[320,"旅費交通費"]
{"$rows_left_out":17}
{"sheet":"入力","index":1,"n_rows":1660,"n_cols":24,"rows_kept":1660,"cut":false,"hidden":false,"merged":[[0,19,3,25]]}
[null,null,null," ",null,null,null,null,null,"現金",null,null,"通帳1",null,null,"郵便振替",null,null,null,"ここから下は、一切触らないでください！"]
[]
[null,null,null,"被災地障害者センターくまもと会計",null,null,null,null,null,null,null,{"$f":"L1347","v":0},null,"現在高",{"$f":"O1347","v":0},null,"現在高",{"$f":"R1347","v":0},{"$f":"S1347","v":0}]
["日付","曜日","cod","　科　目","細目","適用","入金額","出金額","種別",null,null,null,"入金","出金","残高","入金","出金","残高","現金＋預金"]
[null,null,null,{"$f":"IF(C5=\"\",\"\",(VLOOKUP(C5,code2!$A$4:$B$30,2)))","v":""},null,null,null,null,null,{"$f":"IF(I5=\"現金\",G5,\"\")","v":""},{"$f":"IF(I5=\"現金\",H5,\"\")","v":""},0,{"$f":"IF(I5=\"通帳\",G5,\"\")","v":""},{"$f":"IF(I5=\"通帳\",H5,\"\")","v":""},0,{"$f":"IF(I5=\"郵便振替\",G5,\"\")","v":""},{"$f":"IF(I5=\"郵便振替\",H5,\"\")","v":""},0,{"$f":"L5+O5+R5","v":0},null,null,null,{"$f":"MONTH(A5)&\"-\"&D5&E5","v":"1-"}]
[null,null,null,null,null,null,null,null,null,{"$f":"IF(I6=\"現金\",G6,\"\")","v":""},{"$f":"IF(I6=\"現金\",H6,\"\")","v":""},{"$f":"IF(J6&K6=\"\",L5,L5+J6-K6)","v":0},{"$f":"IF(I6=\"通帳\",G6,\"\")","v":""},{"$f":"IF(I6=\"通帳\",H6,\"\")","v":""},{"$f":"IF(M6&N6=\"\",O5,O5+M6-N6)","v":0},{"$f":"IF(I6=\"郵便振替\",G6,\"\")","v":""},{"$f":"IF(I6=\"郵便振替\",H6,\"\")","v":""},{"$f":"IF(P6&Q6=\"\",R5,R5+P6-Q6)","v":0},{"$f":"L6+O6+R6","v":0},null,null,null,{"$f":"MONTH(A6)&\"-\"&D6&E6","v":"1-"}]
[null,{"$f":"IF(A7=\"\",\"\",A7)","v":""},null,{"$f":"IF(C7=\"\",\"\",(VLOOKUP(C7,code2!$A$4:$B$30,2)))","v":""},null,null,null,null,null,"","",0,"","",0,"","",{"$f":"IF(P7&Q7=\"\",R6,R6+P7-Q7)","v":0},0,null,null,null,"1-"]
[null,null,null,{"$f":"IF(C8=\"\",\"\",(VLOOKUP(C8,code2!$A$4:$B$30,2)))","v":""},null,null,null,null,null,{"$f":"IF(I8=\"現金\",G8,\"\")","v":""},{"$f":"IF(I8=\"現金\",H8,\"\")","v":""},0,"","",0,"","",{"$f":"IF(P8&Q8=\"\",R7,R7+P8-Q8)","v":0},{"$f":"L8+O8+R8","v":0},null,null,null,{"$f":"MONTH(A8)&\"-\"&D8","v":"1-"},{"$f":"MONTH(A8)&\"-\"&D8&E8","v":"1-"}]
[null,"",null,{"$f":"IF(C9=\"\",\"\",(VLOOKUP(C9,code2!$A$4:$B$30,2)))","v":""},null,null,null,null,null,"","",0,"","",0,"","",0,0,null,null,null,"1-","1-"]
[null,"",null,{"$f":"IF(C10=\"\",\"\",(VLOOKUP(C10,code2!$A$4:$B$30,2)))","v":""},null,null,null,null,null,"","",0,"","",0,"","",{"$f":"IF(P10&Q10=\"\",R9,R9+P10-Q10)","v":0},{"$f":"L10+O10+R10","v":0},null,null,null,{"$f":"MONTH(A10)&\"-\"&D10","v":"1-"},{"$f":"MONTH(A10)&\"-\"&D10&E10","v":"1-"}]
[null,"",null,{"$f":"IF(C11=\"\",\"\",(VLOOKUP(C11,code2!$A$4:$B$30,2)))","v":""},null,null,null,null,null,"","",0,"","",0,"","",0,0,null,null,null,{"$f":"MONTH(A11)&\"-\"&D11","v":"1-"},{"$f":"MONTH(A11)&\"-\"&D11&E11","v":"1-"}]
[null,"",null,{"$f":"IF(C12=\"\",\"\",(VLOOKUP(C12,code2!$A$4:$B$30,2)))","v":""},null,null,null,null,null,"","",0,{"$f":"IF(I12=\"通帳\",G12,\"\")","v":""},{"$f":"IF(I12=\"通帳\",H12,\"\")","v":""},0,"","",0,0,null,null,null,"1-","1-"]
[null,"",null,{"$f":"IF(C13=\"\",\"\",(VLOOKUP(C13,code2!$A$4:$B$30,2)))","v":""},null,null,null,null,null,"","",0,"","",0,"","",0,0,null,null,null,"1-","1-"]
[null,"",null,{"$f":"IF(C14=\"\",\"\",(VLOOKUP(C14,code2!$A$4:$B$30,2)))","v":""},null,null,null,null,null,"","",0,"","",0,"","",0,0,null,null,null,"1-","1-"]
[null,"",null,{"$f":"IF(C15=\"\",\"\",(VLOOKUP(C15,code2!$A$4:$B$30,2)))","v":""},null,null,null,null,null,"","",0,"","",0,"","",0,0,null,null,null,"1-","1-"]
[null,"",null,{"$f":"IF(C16=\"\",\"\",(VLOOKUP(C16,code2!$A$4:$B$30,2)))","v":""},null,null,null,null,null,"","",0,"","",0,"","",0,0,null,null,null,"1-","1-"]
[null,"",null,{"$f":"IF(C17=\"\",\"\",(VLOOKUP(C17,code2!$A$4:$B$30,2)))","v":""},null,null,null,null,null,"","",0,"","",0,"","",0,0,null,null,null,"1-","1-"]
[null,"",null,{"$f":"IF(C18=\"\",\"\",(VLOOKUP(C18,code2!$A$4:$B$30,2)))","v":""},null,null,null,null,null,"","",0,"","",0,{"$f":"IF(I18=\"郵便振替\",G18,\"\")","v":""},{"$f":"IF(I18=\"郵便振替\",H18,\"\")","v":""},0,0,null,null,null,"1-","1-"]
[null,"",null,{"$f":"IF(C19=\"\",\"\",(VLOOKUP(C19,code2!$A$4:$B$30,2)))","v":""},null,null,null,null,null,"","",0,"","",0,"","",0,0,null,null,null,"1-","1-"]
[null,"",null,{"$f":"IF(C20=\"\",\"\",(VLOOKUP(C20,code2!$A$4:$B$30,2)))","v":""},null,null,null,null,null,"","",0,"","",0,"","",0,0,null,null,null,"1-","1-"]
{"$rows_left_out":1641}
{"sheet":"集計","index":2,"n_rows":44,"n_cols":15,"rows_kept":44,"cut":false,"hidden":false,"merged":[]}
[4,"月集計"]
[]
["収入の部",null,4,5,6,7,8,9,10,11,12,1,2,3,"年間計"]
[null,"寄付金",{"$f":"IF(B4=\"\",\"\",SUMIF(入力!$W$5:$W$1340,C$3&\"-\"&TRIM($B4),入力!$G$5:$G$1347))","v":0},{"$f":"IF(C4=\"\",\"\",SUMIF(入力!$W$5:$W$1340,D$3&\"-\"&TRIM($B4),入力!$G$5:$G$1347))","v":0},{"$f":"IF(D4=\"\",\"\",SUMIF(入力!$W$5:$W$1340,E$3&\"-\"&TRIM($B4),入力!$G$5:$G$1347))","v":0},{"$f":"IF(E4=\"\",\"\",SUMIF(入力!$W$5:$W$1340,F$3&\"-\"&TRIM($B4),入力!$G$5:$G$1347))","v":0},{"$f":"IF(F4=\"\",\"\",SUMIF(入力!$W$5:$W$1340,G$3&\"-\"&TRIM($B4),入力!$G$5:$G$1347))","v":0},{"$f":"IF(G4=\"\",\"\",SUMIF(入力!$W$5:$W$1340,H$3&\"-\"&TRIM($B4),入力!$G$5:$G$1347))","v":0},{"$f":"IF(H4=\"\",\"\",SUMIF(入力!$W$5:$W$1340,I$3&\"-\"&TRIM($B4),入力!$G$5:$G$1347))","v":0},{"$f":"IF(I4=\"\",\"\",SUMIF(入力!$W$5:$W$1340,J$3&\"-\"&TRIM($B4),入力!$G$5:$G$1347))","v":0},{"$f":"IF(J4=\"\",\"\",SUMIF(入力!$W$5:$W$1340,K$3&\"-\"&TRIM($B4),入力!$G$5:$G$1347))","v":0},{"$f":"IF(K4=\"\",\"\",SUMIF(入力!$W$5:$W$1340,L$3&\"-\"&TRIM($B4),入力!$G$5:$G$1347))","v":0},{"$f":"IF(L4=\"\",\"\",SUMIF(入力!$W$5:$W$1340,M$3&\"-\"&TRIM($B4),入力!$G$5:$G$1347))","v":0},{"$f":"IF(M4=\"\",\"\",SUMIF(入力!$W$5:$W$1340,N$3&\"-\"&TRIM($B4),入力!$G$5:$G$1347))","v":0},{"$f":"SUM(C4:N4)","v":0}]
[null,"助成金",{"$f":"IF(B5=\"\",\"\",SUMIF(入力!$W$5:$W$1340,C$3&\"-\"&TRIM($B5),入力!$G$5:$G$1347))","v":0},{"$f":"IF(C5=\"\",\"\",SUMIF(入力!$W$5:$W$1340,D$3&\"-\"&TRIM($B5),入力!$G$5:$G$1347))","v":0},{"$f":"IF(D5=\"\",\"\",SUMIF(入力!$W$5:$W$1340,E$3&\"-\"&TRIM($B5),入力!$G$5:$G$1347))","v":0},{"$f":"IF(E5=\"\",\"\",SUMIF(入力!$W$5:$W$1340,F$3&\"-\"&TRIM($B5),入力!$G$5:$G$1347))","v":0},{"$f":"IF(F5=\"\",\"\",SUMIF(入力!$W$5:$W$1340,G$3&\"-\"&TRIM($B5),入力!$G$5:$G$1347))","v":0},{"$f":"IF(G5=\"\",\"\",SUMIF(入力!$W$5:$W$1340,H$3&\"-\"&TRIM($B5),入力!$G$5:$G$1347))","v":0},{"$f":"IF(H5=\"\",\"\",SUMIF(入力!$W$5:$W$1340,I$3&\"-\"&TRIM($B5),入力!$G$5:$G$1347))","v":0},{"$f":"IF(I5=\"\",\"\",SUMIF(入力!$W$5:$W$1340,J$3&\"-\"&TRIM($B5),入力!$G$5:$G$1347))","v":0},{"$f":"IF(J5=\"\",\"\",SUMIF(入力!$W$5:$W$1340,K$3&\"-\"&TRIM($B5),入力!$G$5:$G$1347))","v":0},{"$f":"IF(K5=\"\",\"\",SUMIF(入力!$W$5:$W$1340,L$3&\"-\"&TRIM($B5),入力!$G$5:$G$1347))","v":0},{"$f":"IF(L5=\"\",\"\",SUMIF(入力!$W$5:$W$1340,M$3&\"-\"&TRIM($B5),入力!$G$5:$G$1347))","v":0},{"$f":"IF(M5=\"\",\"\",SUMIF(入力!$W$5:$W$1340,N$3&\"-\"&TRIM($B5),入力!$G$5:$G$1347))","v":0},{"$f":"SUM(C5:N5)","v":0}]
[null,"受取利息",{"$f":"IF(B6=\"\",\"\",SUMIF(入力!$W$5:$W$1340,C$3&\"-\"&TRIM($B6),入力!$G$5:$G$1347))","v":0},{"$f":"IF(C6=\"\",\"\",SUMIF(入力!$W$5:$W$1340,D$3&\"-\"&TRIM($B6),入力!$G$5:$G$1347))","v":0},{"$f":"IF(D6=\"\",\"\",SUMIF(入力!$W$5:$W$1340,E$3&\"-\"&TRIM($B6),入力!$G$5:$G$1347))","v":0},{"$f":"IF(E6=\"\",\"\",SUMIF(入力!$W$5:$W$1340,F$3&\"-\"&TRIM($B6),入力!$G$5:$G$1347))","v":0},{"$f":"IF(F6=\"\",\"\",SUMIF(入力!$W$5:$W$1340,G$3&\"-\"&TRIM($B6),入力!$G$5:$G$1347))","v":0},{"$f":"IF(G6=\"\",\"\",SUMIF(入力!$W$5:$W$1340,H$3&\"-\"&TRIM($B6),入力!$G$5:$G$1347))","v":0},{"$f":"IF(H6=\"\",\"\",SUMIF(入力!$W$5:$W$1340,I$3&\"-\"&TRIM($B6),入力!$G$5:$G$1347))","v":0},{"$f":"IF(I6=\"\",\"\",SUMIF(入力!$W$5:$W$1340,J$3&\"-\"&TRIM($B6),入力!$G$5:$G$1347))","v":0},{"$f":"IF(J6=\"\",\"\",SUMIF(入力!$W$5:$W$1340,K$3&\"-\"&TRIM($B6),入力!$G$5:$G$1347))","v":0},{"$f":"IF(K6=\"\",\"\",SUMIF(入力!$W$5:$W$1340,L$3&\"-\"&TRIM($B6),入力!$G$5:$G$1347))","v":0},{"$f":"IF(L6=\"\",\"\",SUMIF(入力!$W$5:$W$1340,M$3&\"-\"&TRIM($B6),入力!$G$5:$G$1347))","v":0},{"$f":"IF(M6=\"\",\"\",SUMIF(入力!$W$5:$W$1340,N$3&\"-\"&TRIM($B6),入力!$G$5:$G$1347))","v":0},0]
[null,"雑収入",{"$f":"IF(B7=\"\",\"\",SUMIF(入力!$W$5:$W$1340,C$3&\"-\"&TRIM($B7),入力!$G$5:$G$1347))","v":0},{"$f":"IF(C7=\"\",\"\",SUMIF(入力!$W$5:$W$1340,D$3&\"-\"&TRIM($B7),入力!$G$5:$G$1347))","v":0},{"$f":"IF(D7=\"\",\"\",SUMIF(入力!$W$5:$W$1340,E$3&\"-\"&TRIM($B7),入力!$G$5:$G$1347))","v":0},{"$f":"IF(E7=\"\",\"\",SUMIF(入力!$W$5:$W$1340,F$3&\"-\"&TRIM($B7),入力!$G$5:$G$1347))","v":0},{"$f":"IF(F7=\"\",\"\",SUMIF(入力!$W$5:$W$1340,G$3&\"-\"&TRIM($B7),入力!$G$5:$G$1347))","v":0},{"$f":"IF(G7=\"\",\"\",SUMIF(入力!$W$5:$W$1340,H$3&\"-\"&TRIM($B7),入力!$G$5:$G$1347))","v":0},{"$f":"IF(H7=\"\",\"\",SUMIF(入力!$W$5:$W$1340,I$3&\"-\"&TRIM($B7),入力!$G$5:$G$1347))","v":0},{"$f":"IF(I7=\"\",\"\",SUMIF(入力!$W$5:$W$1340,J$3&\"-\"&TRIM($B7),入力!$G$5:$G$1347))","v":0},{"$f":"IF(J7=\"\",\"\",SUMIF(入力!$W$5:$W$1340,K$3&\"-\"&TRIM($B7),入力!$G$5:$G$1347))","v":0},{"$f":"IF(K7=\"\",\"\",SUMIF(入力!$W$5:$W$1340,L$3&\"-\"&TRIM($B7),入力!$G$5:$G$1347))","v":0},{"$f":"IF(L7=\"\",\"\",SUMIF(入力!$W$5:$W$1340,M$3&\"-\"&TRIM($B7),入力!$G$5:$G$1347))","v":0},{"$f":"IF(M7=\"\",\"\",SUMIF(入力!$W$5:$W$1340,N$3&\"-\"&TRIM($B7),入力!$G$5:$G$1347))","v":0},0]
[null,"合計",{"$f":"SUM(C4:C7)","v":0},{"$f":"SUM(D4:D7)","v":0},{"$f":"SUM(E3:E7)","v":6},0,0,0,0,0,0,0,0,0,6]
[]
[]
[]
["支出の部"]
[null,"事務費",{"$f":"IF(B13=\"\",\"\",SUMIF(入力!$W$5:$W$1340,C$3&\"-\"&TRIM($B13),入力!$H$5:$H$1347))","v":0},{"$f":"IF(C13=\"\",\"\",SUMIF(入力!$W$5:$W$1340,D$3&\"-\"&TRIM($B13),入力!$H$5:$H$1347))","v":0},{"$f":"IF(D13=\"\",\"\",SUMIF(入力!$W$5:$W$1340,E$3&\"-\"&TRIM($B13),入力!$H$5:$H$1347))","v":0},{"$f":"IF(E13=\"\",\"\",SUMIF(入力!$W$5:$W$1340,F$3&\"-\"&TRIM($B13),入力!$H$5:$H$1347))","v":0},{"$f":"IF(F13=\"\",\"\",SUMIF(入力!$W$5:$W$1340,G$3&\"-\"&TRIM($B13),入力!$H$5:$H$1347))","v":0},{"$f":"IF(G13=\"\",\"\",SUMIF(入力!$W$5:$W$1340,H$3&\"-\"&TRIM($B13),入力!$H$5:$H$1347))","v":0},{"$f":"IF(H13=\"\",\"\",SUMIF(入力!$W$5:$W$1340,I$3&\"-\"&TRIM($B13),入力!$H$5:$H$1347))","v":0},{"$f":"IF(I13=\"\",\"\",SUMIF(入力!$W$5:$W$1340,J$3&\"-\"&TRIM($B13),入力!$H$5:$H$1347))","v":0},{"$f":"IF(J13=\"\",\"\",SUMIF(入力!$W$5:$W$1340,K$3&\"-\"&TRIM($B13),入力!$H$5:$H$1347))","v":0},{"$f":"IF(K13=\"\",\"\",SUMIF(入力!$W$5:$W$1340,L$3&\"-\"&TRIM($B13),入力!$H$5:$H$1347))","v":0},{"$f":"IF(L13=\"\",\"\",SUMIF(入力!$W$5:$W$1340,M$3&\"-\"&TRIM($B13),入力!$H$5:$H$1347))","v":0},{"$f":"IF(M13=\"\",\"\",SUMIF(入力!$W$5:$W$1340,N$3&\"-\"&TRIM($B13),入力!$H$5:$H$1347))","v":0},{"$f":"SUM(C13:N13)","v":0}]
[null,"地代・家賃",null,null,null,null,null,null,null,null,null,null,null,null,{"$f":"SUM(C14:N14)","v":0}]
[null,"　家賃",{"$f":"IF(B15=\"\",\"\",SUMIF(入力!$X$5:$X$1340,C$3&\"-\"&$B$14&TRIM($B15),入力!$H$5:$H$1347))","v":0},{"$f":"IF(C15=\"\",\"\",SUMIF(入力!$X$5:$X$1340,D$3&\"-\"&$B$14&TRIM($B15),入力!$H$5:$H$1347))","v":0},{"$f":"IF(D15=\"\",\"\",SUMIF(入力!$X$5:$X$1340,E$3&\"-\"&$B$14&TRIM($B15),入力!$H$5:$H$1347))","v":0},{"$f":"IF(E15=\"\",\"\",SUMIF(入力!$X$5:$X$1340,F$3&\"-\"&$B$14&TRIM($B15),入力!$H$5:$H$1347))","v":0},{"$f":"IF(F15=\"\",\"\",SUMIF(入力!$X$5:$X$1340,G$3&\"-\"&$B$14&TRIM($B15),入力!$H$5:$H$1347))","v":0},{"$f":"IF(G15=\"\",\"\",SUMIF(入力!$X$5:$X$1340,H$3&\"-\"&$B$14&TRIM($B15),入力!$H$5:$H$1347))","v":0},{"$f":"IF(H15=\"\",\"\",SUMIF(入力!$X$5:$X$1340,I$3&\"-\"&$B$14&TRIM($B15),入力!$H$5:$H$1347))","v":0},{"$f":"IF(I15=\"\",\"\",SUMIF(入力!$X$5:$X$1340,J$3&\"-\"&$B$14&TRIM($B15),入力!$H$5:$H$1347))","v":0},{"$f":"IF(J15=\"\",\"\",SUMIF(入力!$X$5:$X$1340,K$3&\"-\"&$B$14&TRIM($B15),入力!$H$5:$H$1347))","v":0},{"$f":"IF(K15=\"\",\"\",SUMIF(入力!$X$5:$X$1340,L$3&\"-\"&$B$14&TRIM($B15),入力!$H$5:$H$1347))","v":0},{"$f":"IF(L15=\"\",\"\",SUMIF(入力!$X$5:$X$1340,M$3&\"-\"&$B$14&TRIM($B15),入力!$H$5:$H$1347))","v":0},{"$f":"IF(M15=\"\",\"\",SUMIF(入力!$X$5:$X$1340,N$3&\"-\"&$B$14&TRIM($B15),入力!$H$5:$H$1347))","v":0},0]
[null,"　駐車場代",{"$f":"IF(B16=\"\",\"\",SUMIF(入力!$X$5:$X$1340,C$3&\"-\"&$B$14&TRIM($B16),入力!$H$5:$H$1347))","v":0},{"$f":"IF(C16=\"\",\"\",SUMIF(入力!$X$5:$X$1340,D$3&\"-\"&$B$14&TRIM($B16),入力!$H$5:$H$1347))","v":0},{"$f":"IF(D16=\"\",\"\",SUMIF(入力!$X$5:$X$1340,E$3&\"-\"&$B$14&TRIM($B16),入力!$H$5:$H$1347))","v":0},{"$f":"IF(E16=\"\",\"\",SUMIF(入力!$X$5:$X$1340,F$3&\"-\"&$B$14&TRIM($B16),入力!$H$5:$H$1347))","v":0},{"$f":"IF(F16=\"\",\"\",SUMIF(入力!$X$5:$X$1340,G$3&\"-\"&$B$14&TRIM($B16),入力!$H$5:$H$1347))","v":0},{"$f":"IF(G16=\"\",\"\",SUMIF(入力!$X$5:$X$1340,H$3&\"-\"&$B$14&TRIM($B16),入力!$H$5:$H$1347))","v":0},{"$f":"IF(H16=\"\",\"\",SUMIF(入力!$X$5:$X$1340,I$3&\"-\"&$B$14&TRIM($B16),入力!$H$5:$H$1347))","v":0},{"$f":"IF(I16=\"\",\"\",SUMIF(入力!$X$5:$X$1340,J$3&\"-\"&$B$14&TRIM($B16),入力!$H$5:$H$1347))","v":0},{"$f":"IF(J16=\"\",\"\",SUMIF(入力!$X$5:$X$1340,K$3&\"-\"&$B$14&TRIM($B16),入力!$H$5:$H$1347))","v":0},{"$f":"IF(K16=\"\",\"\",SUMIF(入力!$X$5:$X$1340,L$3&\"-\"&$B$14&TRIM($B16),入力!$H$5:$H$1347))","v":0},{"$f":"IF(L16=\"\",\"\",SUMIF(入力!$X$5:$X$1340,M$3&\"-\"&$B$14&TRIM($B16),入力!$H$5:$H$1347))","v":0},{"$f":"IF(M16=\"\",\"\",SUMIF(入力!$X$5:$X$1340,N$3&\"-\"&$B$14&TRIM($B16),入力!$H$5:$H$1347))","v":0},0]
[null,"車両費",null,null,null,null,null,null,null,null,null,null,null,null,0]
[null,"　ガソリン代",{"$f":"IF(B18=\"\",\"\",SUMIF(入力!$X$5:$X$1340,C$3&\"-\"&$B$17&TRIM($B18),入力!$H$5:$H$1347))","v":0},{"$f":"IF(C18=\"\",\"\",SUMIF(入力!$X$5:$X$1340,D$3&\"-\"&$B$17&TRIM($B18),入力!$H$5:$H$1347))","v":0},{"$f":"IF(D18=\"\",\"\",SUMIF(入力!$X$5:$X$1340,E$3&\"-\"&$B$17&TRIM($B18),入力!$H$5:$H$1347))","v":0},{"$f":"IF(E18=\"\",\"\",SUMIF(入力!$X$5:$X$1340,F$3&\"-\"&$B$17&TRIM($B18),入力!$H$5:$H$1347))","v":0},{"$f":"IF(F18=\"\",\"\",SUMIF(入力!$X$5:$X$1340,G$3&\"-\"&$B$17&TRIM($B18),入力!$H$5:$H$1347))","v":0},{"$f":"IF(G18=\"\",\"\",SUMIF(入力!$X$5:$X$1340,H$3&\"-\"&$B$17&TRIM($B18),入力!$H$5:$H$1347))","v":0},{"$f":"IF(H18=\"\",\"\",SUMIF(入力!$X$5:$X$1340,I$3&\"-\"&$B$17&TRIM($B18),入力!$H$5:$H$1347))","v":0},{"$f":"IF(I18=\"\",\"\",SUMIF(入力!$X$5:$X$1340,J$3&\"-\"&$B$17&TRIM($B18),入力!$H$5:$H$1347))","v":0},{"$f":"IF(J18=\"\",\"\",SUMIF(入力!$X$5:$X$1340,K$3&\"-\"&$B$17&TRIM($B18),入力!$H$5:$H$1347))","v":0},{"$f":"IF(K18=\"\",\"\",SUMIF(入力!$X$5:$X$1340,L$3&\"-\"&$B$17&TRIM($B18),入力!$H$5:$H$1347))","v":0},{"$f":"IF(L18=\"\",\"\",SUMIF(入力!$X$5:$X$1340,M$3&\"-\"&$B$17&TRIM($B18),入力!$H$5:$H$1347))","v":0},{"$f":"IF(M18=\"\",\"\",SUMIF(入力!$X$5:$X$1340,N$3&\"-\"&$B$17&TRIM($B18),入力!$H$5:$H$1347))","v":0},0]
[null,"　保険",{"$f":"IF(B19=\"\",\"\",SUMIF(入力!$X$5:$X$1340,C$3&\"-\"&$B$17&TRIM($B19),入力!$H$5:$H$1347))","v":0},{"$f":"IF(C19=\"\",\"\",SUMIF(入力!$X$5:$X$1340,D$3&\"-\"&$B$17&TRIM($B19),入力!$H$5:$H$1347))","v":0},{"$f":"IF(D19=\"\",\"\",SUMIF(入力!$X$5:$X$1340,E$3&\"-\"&$B$17&TRIM($B19),入力!$H$5:$H$1347))","v":0},{"$f":"IF(E19=\"\",\"\",SUMIF(入力!$X$5:$X$1340,F$3&\"-\"&$B$17&TRIM($B19),入力!$H$5:$H$1347))","v":0},{"$f":"IF(F19=\"\",\"\",SUMIF(入力!$X$5:$X$1340,G$3&\"-\"&$B$17&TRIM($B19),入力!$H$5:$H$1347))","v":0},{"$f":"IF(G19=\"\",\"\",SUMIF(入力!$X$5:$X$1340,H$3&\"-\"&$B$17&TRIM($B19),入力!$H$5:$H$1347))","v":0},{"$f":"IF(H19=\"\",\"\",SUMIF(入力!$X$5:$X$1340,I$3&\"-\"&$B$17&TRIM($B19),入力!$H$5:$H$1347))","v":0},{"$f":"IF(I19=\"\",\"\",SUMIF(入力!$X$5:$X$1340,J$3&\"-\"&$B$17&TRIM($B19),入力!$H$5:$H$1347))","v":0},{"$f":"IF(J19=\"\",\"\",SUMIF(入力!$X$5:$X$1340,K$3&\"-\"&$B$17&TRIM($B19),入力!$H$5:$H$1347))","v":0},{"$f":"IF(K19=\"\",\"\",SUMIF(入力!$X$5:$X$1340,L$3&\"-\"&$B$17&TRIM($B19),入力!$H$5:$H$1347))","v":0},{"$f":"IF(L19=\"\",\"\",SUMIF(入力!$X$5:$X$1340,M$3&\"-\"&$B$17&TRIM($B19),入力!$H$5:$H$1347))","v":0},{"$f":"IF(M19=\"\",\"\",SUMIF(入力!$X$5:$X$1340,N$3&\"-\"&$B$17&TRIM($B19),入力!$H$5:$H$1347))","v":0},0]
[null,"　車検費用",{"$f":"IF(B20=\"\",\"\",SUMIF(入力!$X$5:$X$1340,C$3&\"-\"&$B$17&TRIM($B20),入力!$H$5:$H$1347))","v":0},{"$f":"IF(C20=\"\",\"\",SUMIF(入力!$X$5:$X$1340,D$3&\"-\"&$B$17&TRIM($B20),入力!$H$5:$H$1347))","v":0},{"$f":"IF(D20=\"\",\"\",SUMIF(入力!$X$5:$X$1340,E$3&\"-\"&$B$17&TRIM($B20),入力!$H$5:$H$1347))","v":0},{"$f":"IF(E20=\"\",\"\",SUMIF(入力!$X$5:$X$1340,F$3&\"-\"&$B$17&TRIM($B20),入力!$H$5:$H$1347))","v":0},{"$f":"IF(F20=\"\",\"\",SUMIF(入力!$X$5:$X$1340,G$3&\"-\"&$B$17&TRIM($B20),入力!$H$5:$H$1347))","v":0},{"$f":"IF(G20=\"\",\"\",SUMIF(入力!$X$5:$X$1340,H$3&\"-\"&$B$17&TRIM($B20),入力!$H$5:$H$1347))","v":0},{"$f":"IF(H20=\"\",\"\",SUMIF(入力!$X$5:$X$1340,I$3&\"-\"&$B$17&TRIM($B20),入力!$H$5:$H$1347))","v":0},{"$f":"IF(I20=\"\",\"\",SUMIF(入力!$X$5:$X$1340,J$3&\"-\"&$B$17&TRIM($B20),入力!$H$5:$H$1347))","v":0},{"$f":"IF(J20=\"\",\"\",SUMIF(入力!$X$5:$X$1340,K$3&\"-\"&$B$17&TRIM($B20),入力!$H$5:$H$1347))","v":0},{"$f":"IF(K20=\"\",\"\",SUMIF(入力!$X$5:$X$1340,L$3&\"-\"&$B$17&TRIM($B20),入力!$H$5:$H$1347))","v":0},{"$f":"IF(L20=\"\",\"\",SUMIF(入力!$X$5:$X$1340,M$3&\"-\"&$B$17&TRIM($B20),入力!$H$5:$H$1347))","v":0},{"$f":"IF(M20=\"\",\"\",SUMIF(入力!$X$5:$X$1340,N$3&\"-\"&$B$17&TRIM($B20),入力!$H$5:$H$1347))","v":0},0]
{"$rows_left_out":24}